BDBM47743 2-Bromo-N-[1-methyl-2-phenyl-eth-(E)-ylidene-hydrazinocarbonylmethyl]-benzamide::2-bromanyl-N-[2-oxidanylidene-2-[2-(1-phenylpropan-2-ylidene)hydrazinyl]ethyl]benzamide::2-bromo-N-[2-keto-2-[N'-(1-methyl-2-phenyl-ethylidene)hydrazino]ethyl]benzamide::2-bromo-N-[2-oxo-2-[2-(1-phenylpropan-2-ylidene)hydrazinyl]ethyl]benzamide::MLS000587416::SMR000211388::cid_603176
SMILES CC(Cc1ccccc1)=NNC(=O)CNC(=O)c1ccccc1Br
InChI Key InChIKey=OKNSWOQWXKFWTI-UHFFFAOYSA-N
Data  5 EC50
  Tab Delimited (TSV)   2D SDfile   Computed 3D by Vconf -m prep SDfile
Find this compound or compounds like it in BindingDB:
Activity Spreadsheet -- Enzyme Inhibition Constant Data from BindingDB
Found 1 hit for monomerid = 47743
TargetRegulator of G-protein signaling 19(Homo sapiens (Human))
Nmmlsc
Curated by PubChem BioAssay
LigandPNGBDBM47743(2-Bromo-N-[1-methyl-2-phenyl-eth-(E)-ylidene-hydra...)
Affinity DataEC50: >3.00E+4nM. Assay description: University of New Mexico Assay Overview: Assay Support: NIH R21NS057014 HTS to identify small molecule regulators of RGS family protein interaction...
In DepthDetails PCBioAssay